{"text_format":"1","workbook":"xlsx","n_sheets":6,"sheets":["報告書 (記入例)","報告書","個人情報の取扱について","学校一覧","【統廃合】変更履歴","プルダウン用データ"],"not_rendered":{"charts":0,"images":4,"macros":1,"external_links":0,"defined_names":33,"comments":0,"pivot_tables":0},"unopened":[],"bounds":{"document_bytes":16777216,"sheet_cells":100000,"rows_first":2000,"rows_last":500,"rows_between":2000,"halvings":0,"cell_chars":16384,"cell_head_chars":4096},"cells_cut":0,"cells_raw":0,"read":"whole","date_system":"1900"}

{"sheet":"報告書 (記入例)","index":0,"n_rows":57,"n_cols":64,"rows_kept":57,"cut":false,"hidden":false,"merged":[[2,35,2,39],[2,40,2,49],[2,57,3,64],[4,35,4,39],[4,40,4,49],[4,51,4,53],[4,54,4,56],[4,60,4,63],[13,55,13,63],[6,35,6,63],[9,45,9,63],[10,35,29,35],[10,36,13,40],[10,41,10,42],[10,43,10,52],[10,53,12,54],[10,55,12,63],[11,41,11,42],[11,43,11,52],[13,41,13,46],[13,47,13,48],[13,49,13,50],[13,51,13,52],[13,53,13,54],[17,36,19,40],[17,41,17,63],[18,41,18,63],[19,41,19,63],[20,36,20,40],[20,41,20,63],[16,36,16,40],[14,36,14,40],[14,41,14,43],[14,44,14,45],[14,47,14,48],[14,50,14,51],[14,53,14,55],[14,57,14,58],[14,59,14,63],[15,36,15,40],[15,41,15,49],[15,50,15,62],[23,36,23,40],[23,41,23,43],[23,44,23,48],[23,49,23,51],[23,52,23,55],[23,56,23,63],[24,36,24,40],[24,41,24,62],[21,36,21,40],[21,41,21,63],[22,36,22,40],[22,41,22,51],[22,52,22,55],[22,56,22,63],[27,36,28,40],[27,42,27,43],[27,45,27,46],[27,47,27,63],[28,41,28,63],[25,36,26,40],[25,41,25,42],[25,43,25,51],[25,52,26,55],[25,56,26,60],[25,61,26,62],[48,6,49,25],[50,9,50,22],[44,36,44,37],[44,38,44,39],[44,45,44,46],[31,35,44,35],[29,36,29,40],[29,44,29,45],[29,47,29,48],[38,40,38,49],[7,44,8,50],[12,41,12,52],[49,50,49,63],[45,34,45,64],[48,50,48,53],[54,35,56,51],[44,47,44,52],[44,53,44,56],[44,57,44,63],[38,56,38,57],[38,59,38,60],[42,36,43,37],[42,38,43,43],[42,45,42,49],[42,50,43,51],[42,52,43,63],[43,45,43,49],[29,50,29,51],[29,53,29,63],[33,56,34,63],[36,55,37,63],[38,53,38,54],[25,63,26,63],[26,41,26,51]]}
[]
[]
[null,null,null,null,null,null,null,null,null,null,null,null,null,null,null,null,null,null,null,null,null,null,null,null,null,null,null,null,null,null,null,null,null,null,null," 県・市町村/国立",null,null,null,null,"○○市立",null,null,null,null,null,null,null,null,null,null,null,null,null,null,null,null,"FAX　0120-937-743"]
[]
[null,null,null,null,null,null,null,null,null,null,null,null,null,null,null,null,null,null,null,null,null,null,null,null,null,null,null,null,null,null,null,null,null,null,null," 学校名",null,null,null,null,"XX小学校",null,null,null,null,null,null,null,null,null,null,"保険会社使用欄",null,null,{"$f":"IFERROR(VLOOKUP(AO5,学校一覧!$D$2:$I$278,7,FALSE),\"\")","v":""},null,null,null,null,null,"FAX用"]
[]
[null,null,null,null,null,null,null,null,null,null,null,null,null,null,null,null,null,null,null,null,null,null,null,null,null,null,null,null,null,null,null,null,null,null,null,"　事故報告書　兼　事故証明書（傷害事故用）"]
[null,null,null,null,null,null,null,null,null,null,null,null,null,null,null,null,null,null,null,null,null,null,null,null,null,null,null,null,null,null,null,null,null,null,null,null,null,null,null,null,null,null,null,null,"※対象の保険証券に☑をお願いします",null,null,null,null,null,null,null,null,"証券番号24S0146209　（学校契約団体傷害保険）"]
[null,null,null,null,null,null,null,null,null,null,null,null,null,null,null,null,null,null,null,null,null,null,null,null,null,null,null,null,null,null,null,null,null,null,null,"AIG損害保険株式会社　　宛　　　　　　　　　　　　　　　　",null,null,null,null,null,null,null,null,null,null,null,null,null,null,null,null,null,"証券番号24S0146217　（PTA団体傷害保険）"]
[null,null,null,null,null,null,null,null,null,null,null,null,null,null,null,null,null,null,null,null,null,null,null,null,null,null,null,null,null,null,null,null,null,null,null,null,null,null,null,null,null,null,null,null,null,"＊印の欄は該当するものに○印を記入してください。"]
[null,null,null,null,null,null,null,null,null,null,null,null,null,null,null,null,null,null,null,null,null,null,null,null,null,null,null,null,null,null,null,null,null,null,null,"保　護　者 ・ P　T　A　会　員　等　記　入　欄","被保険者のお名前\n（ケガをした人）",null,null,null,null,"（フリガナ）",null,"　　　      エイアイ　　　　ハナコ",null,null,null,null,null,null,null,null,null,"区分＊",null,"児童生徒　・　保護者　・　教職員　\nPTA会員の同居の親族　・　PTAが事前に認めた方　"]
[null,null,null,null,null,null,null,null,null,null,null,null,null,null,null,null,null,null,null,null,null,null,null,null,null,null,null,null,null,null,null,null,null,null,null,null,null,null,null,null,null,"氏名",null,"       永合　　花子"]
[null,null,null,null,null,null,null,null,null,null,null,null,null,null,null,null,null,null,null,null,null,null,null,null,null,null,null,null,null,null,null,null,null,null,null,null,null,null,null,null,null,"(生年月日）西暦 20xx年　xx月　xx日（　　　x 歳）"]
[null,null,null,null,null,null,null,null,null,null,null,null,null,null,null,null,null,null,null,null,null,null,null,null,null,null,null,null,null,null,null,null,null,null,null,null,null,null,null,null,null,"（児童生徒の場合）",null,null,null,null,null,"第",null,"○",null,"学年",null,"△",null,"組　　  　に在学 　　*受傷時点"]
[null,null,null,null,null,null,null,null,null,null,null,null,null,null,null,null,null,null,null,null,null,null,null,null,null,null,null,null,null,null,null,null,null,null,null,null,"事故発生日時",null,null,null,null,20,null,null,"XX",null,"年",4,null,"月",5,null,"日",10,null,null,"時",30,null,"分頃"]
[null,null,null,null,null,null,null,null,null,null,null,null,null,null,null,null,null,null,null,null,null,null,null,null,null,null,null,null,null,null,null,null,null,null,null,null,"事故発生場所＊",null,null,null,null,"自宅　　・　　学校　　・　　その他（",null,null,null,null,null,null,null,null,"自宅近くの公園",null,null,null,null,null,null,null,null,null,null,null,null,"）"]
[null,null,null,null,null,null,null,null,null,null,null,null,null,null,null,null,null,null,null,null,null,null,null,null,null,null,null,null,null,null,null,null,null,null,null,null,"事故の原因＊",null,null,null,null,"運動中（スポ少・部活動）・  家庭生活中  ・  登下校中  ・  PTA活動中  ・ その他（",null,null,null,null,null,null,null,null,null,null,null,null,null,null,null,null,null,null,null,null,null,"）"]
[null,null,null,null,null,null,null,null,null,null,null,null,null,null,null,null,null,null,null,null,null,null,null,null,null,null,null,null,null,null,null,null,null,null,null,null,"事故の状況＊",null,null,null,null,"転倒　　・　　転落　　・　　衝突　　・　　熱中症　　・　　食中毒　　・　　落下物、飛来物による事故"]
[null,null,null,null,null,null,null,null,null,null,null,null,null,null,null,null,null,null,null,null,null,null,null,null,null,null,null,null,null,null,null,null,null,null,null,null,null,null,null,null,null,"その他　⇒　具体的な状況をご記入ください。"]
[null,null,null,null,null,null,null,null,null,null,null,null,null,null,null,null,null,null,null,null,null,null,null,null,null,null,null,null,null,null,null,null,null,null,null,null,null,null,null,null,null,"友人とサッカーをして遊んでいる最中に、ボールの奪い合いで友人と衝突して転倒し、右手首を骨折した。"]
{"$rows_left_out":38}
{"sheet":"報告書","index":1,"n_rows":57,"n_cols":31,"rows_kept":57,"cut":false,"hidden":false,"merged":[[24,8,24,29],[21,8,21,30],[48,17,48,20],[29,20,29,30],[38,20,38,21],[38,23,38,24],[38,26,38,27],[42,17,43,18],[42,19,43,30],[42,5,43,11],[44,5,44,6],[38,7,38,16],[23,19,23,22],[23,23,23,30],[44,24,44,30],[42,12,42,16],[4,21,4,23],[22,23,22,30],[6,2,6,30],[10,2,29,2],[17,3,19,7],[17,8,17,30],[10,8,10,9],[18,8,18,30],[9,12,9,30],[4,7,4,16],[13,20,13,21],[13,22,13,30],[14,26,14,30],[7,12,8,18],[24,3,24,7],[25,30,26,30],[2,7,2,16],[4,18,4,20],[14,3,14,7],[15,3,15,7],[10,3,13,7],[10,10,10,19],[11,8,11,9],[13,14,13,15],[13,16,13,17],[13,18,13,19],[15,8,15,16],[15,17,15,29],[2,24,3,31],[11,10,11,19],[4,27,4,30],[14,24,14,25],[2,2,2,6],[4,2,4,6],[45,1,45,31],[29,3,29,7],[25,3,26,7],[27,3,28,7],[27,14,27,30],[28,8,28,30],[20,3,20,7],[19,8,19,30],[22,3,22,7],[13,8,13,13],[16,3,16,7],[36,22,37,30],[25,8,25,9],[25,23,26,27],[43,12,43,16],[27,9,27,10],[27,12,27,13],[33,23,34,30],[54,2,56,18],[31,2,44,2],[49,17,49,20],[49,21,49,30],[42,3,43,4],[44,12,44,13],[44,3,44,4],[44,20,44,23],[44,14,44,19],[25,28,26,29],[29,11,29,12],[29,14,29,15],[29,17,29,18],[25,19,26,22],[25,10,25,18],[26,8,26,18],[12,8,12,19],[10,20,12,21],[10,22,12,30],[23,3,23,7],[23,8,23,10],[23,11,23,15],[23,16,23,18],[22,19,22,22],[22,8,22,18],[14,8,14,10],[14,11,14,12],[14,14,14,15],[14,17,14,18],[14,20,14,22],[20,8,20,30],[21,3,21,7]]}
[]
[]
[null,null," 県・市町村/国立",null,null,null,null,"--プルダウンでご選択ください--",null,null,null,null,null,null,null,null,null,null,null,null,null,null,null,null,"FAX　0120-937-743"]
[]
[null,null," 学校名",null,null,null,null,null,null,null,null,null,null,null,null,null,null,null,"保険会社使用欄",null,null,{"$f":"IFERROR(VLOOKUP(H5,学校一覧!$D$2:$J$400,7,FALSE),\"\")","v":""},null,null,null,null,null,"FAX用"]
[]
[null,null,"　事故報告書　兼　事故証明書（傷害事故用）"]
[null,null,null,null,null,null,null,null,null,null,null,null,"※対象の保険証券に☑をお願いします",null,null,null,null,null,null,null,"証券番号24S0146209　（学校契約団体傷害保険）"]
[null,null,"AIG損害保険株式会社　　宛　　　　　　　　　　　　　　　　",null,null,null,null,null,null,null,null,null,null,null,null,null,null,null,null,null,"証券番号24S0146217　（PTA団体傷害保険）"]
[null,null,null,null,null,null,null,null,null,null,null,null,"＊印の欄は該当するものに○印を記入してください。"]
[null,null,"保　護　者 ・ P　T　A　会　員　等　記　入　欄","被保険者のお名前\n（ケガをした人）",null,null,null,null,"（フリガナ）",null,null,null,null,null,null,null,null,null,null,null,"区分＊",null,"児童生徒　・　保護者　・　教職員　\nPTA会員の同居の親族　・　PTAが事前に認めた方　"]
[null,null,null,null,null,null,null,null,"氏名"]
[null,null,null,null,null,null,null,null,"(生年月日）西暦20　 　年　　 　月　　　 日（　　　  歳）"]
[null,null,null,null,null,null,null,null,"（児童生徒の場合）",null,null,null,null,null,"第",null,null,null,"学年",null,null,null,"組　　  　に在学 　　*受傷時点"]
[null,null,null,"事故発生日時",null,null,null,null,20,null,null,null,null,"年",null,null,"月",null,null,"日",null,null,null,"時",null,null,"分頃"]
[null,null,null,"事故発生場所＊",null,null,null,null,"自宅　　・　　学校　　・　　その他（",null,null,null,null,null,null,null,null,null,null,null,null,null,null,null,null,null,null,null,null,null,"）"]
[null,null,null,"事故の原因＊",null,null,null,null,"運動中（スポ少・部活動）・  家庭生活中  ・  登下校中  ・  PTA活動中  ・ その他（",null,null,null,null,null,null,null,null,null,null,null,null,null,null,null,null,null,null,null,null,null,"）"]
[null,null,null,"事故の状況＊",null,null,null,null,"転倒　　・　　転落　　・　　衝突　　・　　熱中症　　・　　食中毒　　・　　落下物、飛来物による事故"]
[null,null,null,null,null,null,null,null,"その他　⇒　具体的な状況をご記入ください。"]
[]
{"$rows_left_out":38}
{"sheet":"個人情報の取扱について","index":2,"n_rows":0,"n_cols":0,"rows_kept":0,"cut":false,"hidden":true,"merged":[]}

{"sheet":"学校一覧","index":3,"n_rows":278,"n_cols":10,"rows_kept":278,"cut":false,"hidden":true,"merged":[]}
["No.","保険会社使用コード","学校名（県立/市立+学校名）","学　校　名","郵便番号","秋田県","県立/市立","住　　　　　　　　所","電話番号","保険会社使用コード"]
[1,"AK001","鹿角市立花輪小学校","花輪小学校","018-5201","秋田県","鹿角市立","鹿角市花輪字中花輪88","0186-23-2007","AK001"]
[2,"AK002","鹿角市立柴平小学校","柴平小学校","018-5201","秋田県","鹿角市立","鹿角市花輪字高市向35","0186-30-2660","AK002"]
[4,"AK004","鹿角市立十和田小学校","十和田小学校","018-5334","秋田県","鹿角市立","鹿角市十和田毛馬内字上新田1-1","0186-35-2042","AK004"]
[5,"AK005","鹿角市立大湯小学校","大湯小学校","018-5421","秋田県","鹿角市立","鹿角市十和田大湯字権現堂15-1","0186-37-2040","AK005"]
[6,"AK006","鹿角市立尾去沢小学校","尾去沢小学校","018-5202","秋田県","鹿角市立","鹿角市尾去沢字上山201-1","0186-23-3201","AK006"]
[7,"AK007","鹿角市立八幡平小学校","八幡平小学校","018-5141","秋田県","鹿角市立","鹿角市八幡平字長嶺川原1","0186-32-2011","AK007"]
[8,"AK008","小坂町立小坂小学校","小坂小学校","017-0201","秋田県","小坂町立","鹿角郡小坂町小坂字赤神4-1","0186-29-2422","AK008"]
[9,"AK009","鹿角市立花輪中学校","花輪中学校","018-5201","秋田県","鹿角市立","鹿角市花輪字陳場125","0186-23-2257","AK009"]
[10,"AK010","鹿角市立十和田中学校","十和田中学校","018-5334","秋田県","鹿角市立","鹿角市十和田毛馬内字上土ヶ久保22-1","0186-35-2164","AK010"]
[11,"AK011","鹿角市立尾去沢中学校","尾去沢中学校","018-5202","秋田県","鹿角市立","鹿角市尾去沢字上山239-1","0186-23-2270","AK011"]
[12,"AK012","鹿角市立八幡平中学校","八幡平中学校","018-5141","秋田県","鹿角市立","鹿角市八幡平字諸田4-1","0186-32-2226","AK012"]
[13,"AK013","小坂町立小坂中学校","小坂中学校","017-0201","秋田県","小坂町立","鹿角郡小坂町小坂字赤神4-1","0186-29-3232","AK013"]
[14,"AK014","大館市立桂城小学校","桂城小学校","017-0887","秋田県","大館市立","大館市水門町1-12","0186-42-2262","AK014"]
[15,"AK015","大館市立城南小学校","城南小学校","017-0821","秋田県","大館市立","大館市字桜町9","0186-42-3025","AK015"]
[16,"AK016","大館市立城西小学校","城西小学校","017-0865","秋田県","大館市立","大館市城西町8-1","0186-42-3238","AK016"]
[17,"AK017","大館市立有浦小学校","有浦小学校","017-0043","秋田県","大館市立","大館市有浦四丁目6-55","0186-42-2834","AK017"]
[18,"AK018","大館市立釈迦内小学校","釈迦内小学校","017-0012","秋田県","大館市立","大館市釈迦内字相染台24","0186-48-2934","AK018"]
[19,"AK019","大館市立長木小学校","長木小学校","017-0031","秋田県","大館市立","大館市上代野字八幡岱45","0186-48-5158","AK019"]
[20,"AK020","大館市立川口小学校","川口小学校","017-0878","秋田県","大館市立","大館市川口字隼人岱108-68","0186-42-9762","AK020"]
{"$rows_left_out":259}
{"sheet":"【統廃合】変更履歴","index":4,"n_rows":44,"n_cols":14,"rows_kept":44,"cut":false,"hidden":true,"merged":[]}
[null,"＜変更履歴＞"]
[]
[null,"No.","保険会社使用コード","学校名（県立/市立+学校名）","学　校　名","郵便番号","秋田県","県立/市立","住　　　　　　　　所","電話番号","変更内容","新学校名","変更後コード","変更年月"]
[null,2,"AK002","鹿角市立花輪北小学校","花輪北小学校","018-5201","秋田県","鹿角市立","鹿角市花輪字新川端20","0186-23-2603","合併後新設","柴平小学校","AK002","2021-04-01"]
[null,3,"AK003","鹿角市立平元小学校","平元小学校","018-5201","秋田県","鹿角市立","鹿角市花輪字源田平6-1","0186-25-2204","合併後新設","柴平小学校","AK002","2021-04-01"]
[null,34,"AK034","北秋田市立鷹巣中央小学校","鷹巣中央小学校","018-3454","秋田県","北秋田市立","北秋田市脇神字高村岱79-12","0186-62-1558","合併後新設","清鷹小学校","AK034","2021-04-01"]
[null,35,"AK035","北秋田市立鷹巣南小学校","鷹巣南小学校","018-3452","秋田県","北秋田市立","北秋田市七日市字中岱31","0186-66-2053","合併後新設","清鷹小学校","AK034","2021-04-01"]
[null,179,"AK179","由利本荘市立小友小学校","小友小学校","015-0063","秋田県","由利本荘市立","由利本荘市館前字後田20","0184-22-4017","－","小友小学校","AK179","2021-04-01"]
[null,180,"AK180","由利本荘市立石沢小学校","石沢小学校","015-0086","秋田県","由利本荘市立","由利本荘市館字六角167","0184-29-2341","統合により学校名変更","小友小学校","AK179","2021-04-01"]
[null,217,"AK217","大仙市立豊川小学校","豊川小学校","014-0711","秋田県","大仙市立","大仙市豊川字下水無47","0187-57-2324","合併後新設","豊成小学校","AK217","2021-04-01"]
[null,218,"AK218","大仙市立豊岡小学校","豊岡小学校","014-0712","秋田県","大仙市立","大仙市豊岡字中荒井野29","0187-57-2134","合併後新設","豊成小学校","AK217","2021-04-01"]
[null,232,"AK232","大仙市立中仙中学校","中仙中学校","014-0207","秋田県","大仙市立","大仙市長野字新山5-1","0187-56-2328","－","中仙中学校","AK232","2021-04-01"]
[null,233,"AK233","大仙市立豊成中学校","豊成中学校","014-0712","秋田県","大仙市立","大仙市豊岡字杉ケ崎57","0187-57-2040","統合により学校名変更","中仙中学校","AK232","2021-04-01"]
[null,264,"AK264","横手市立十文字第一小学校","十文字第一小学校","019-0523","秋田県","横手市立","横手市十文字町字十文字48","0182-42-1020","合併後新設","十文字小学校","AK264","2021-04-01"]
[null,265,"AK265","横手市立十文字第二小学校","十文字第二小学校","019-0508","秋田県","横手市立","横手市十文字町十五野新田字増田道東19","0182-42-1025","合併後新設","十文字小学校","AK264","2021-04-01"]
[null,266,"AK266","横手市立植田小学校","植田小学校","019-0513","秋田県","横手市立","横手市十文字町植田字忍ノ沢14-4","0182-44-3321","合併後新設","十文字小学校","AK264","2021-04-01"]
[null,267,"AK267","横手市立睦合小学校","睦合小学校","019-0514","秋田県","横手市立","横手市十文字町睦合字宿屋布36","0182-44-3322","合併後新設","十文字小学校","AK264","2021-04-01"]
[null,278,"AK278","湯沢市立湯沢西小学校","湯沢西小学校","012-0855","秋田県","湯沢市立","湯沢市愛宕町三丁目7-10",725150,"統合により学校名変更","湯沢西小学校","AK278","2021-04-01"]
[null,279,"AK279","湯沢市立三関小学校","三関小学校","012-0862","秋田県","湯沢市立","湯沢市関口字堀量68",732926,"統合により学校名変更","湯沢西小学校","AK278","2021-04-01"]
[null,281,"AK281","湯沢市立須川小学校","須川小学校","019-0402","秋田県","湯沢市立","湯沢市相川字須川119-7",792521,"統合により学校名変更","湯沢西小学校","AK278","2021-04-01"]
{"$rows_left_out":25}
{"sheet":"プルダウン用データ","index":5,"n_rows":63,"n_cols":29,"rows_kept":63,"cut":false,"hidden":true,"merged":[]}
[null,null,{"$f":"COUNTA(C$4:C$300)=C2","v":true},{"$f":"COUNTA(D$4:D$300)=D2","v":true},true,true,true,true,true,true,true,true,true,true,true,true,true,true,true,true,true,true,true,true,true,true,true,true]
[null,null,{"$f":"COUNTIFS(学校一覧!$G$2:$G$301,プルダウン用データ!C$3)","v":3},{"$f":"COUNTIFS(学校一覧!$G$2:$G$301,プルダウン用データ!D$3)","v":60},{"$f":"COUNTIFS(学校一覧!$G$2:$G$301,プルダウン用データ!E$3)","v":1},{"$f":"COUNTIFS(学校一覧!$G$2:$G$301,プルダウン用データ!F$3)","v":5},{"$f":"COUNTIFS(学校一覧!$G$2:$G$301,プルダウン用データ!G$3)","v":2},{"$f":"COUNTIFS(学校一覧!$G$2:$G$301,プルダウン用データ!H$3)","v":25},{"$f":"COUNTIFS(学校一覧!$G$2:$G$301,プルダウン用データ!I$3)","v":8},{"$f":"COUNTIFS(学校一覧!$G$2:$G$301,プルダウン用データ!J$3)","v":9},{"$f":"COUNTIFS(学校一覧!$G$2:$G$301,プルダウン用データ!K$3)","v":10},{"$f":"COUNTIFS(学校一覧!$G$2:$G$301,プルダウン用データ!L$3)","v":1},{"$f":"COUNTIFS(学校一覧!$G$2:$G$301,プルダウン用データ!M$3)","v":11},{"$f":"COUNTIFS(学校一覧!$G$2:$G$301,プルダウン用データ!N$3)","v":2},{"$f":"COUNTIFS(学校一覧!$G$2:$G$301,プルダウン用データ!O$3)","v":2},{"$f":"COUNTIFS(学校一覧!$G$2:$G$301,プルダウン用データ!P$3)","v":11},{"$f":"COUNTIFS(学校一覧!$G$2:$G$301,プルダウン用データ!Q$3)","v":30},{"$f":"COUNTIFS(学校一覧!$G$2:$G$301,プルダウン用データ!R$3)","v":7},{"$f":"COUNTIFS(学校一覧!$G$2:$G$301,プルダウン用データ!S$3)","v":13},{"$f":"COUNTIFS(学校一覧!$G$2:$G$301,プルダウン用データ!T$3)","v":2},{"$f":"COUNTIFS(学校一覧!$G$2:$G$301,プルダウン用データ!U$3)","v":3},{"$f":"COUNTIFS(学校一覧!$G$2:$G$301,プルダウン用データ!V$3)","v":2},{"$f":"COUNTIFS(学校一覧!$G$2:$G$301,プルダウン用データ!W$3)","v":1},{"$f":"COUNTIFS(学校一覧!$G$2:$G$301,プルダウン用データ!X$3)","v":4},{"$f":"COUNTIFS(学校一覧!$G$2:$G$301,プルダウン用データ!Y$3)","v":8},{"$f":"COUNTIFS(学校一覧!$G$2:$G$301,プルダウン用データ!Z$3)","v":12},{"$f":"COUNTIFS(学校一覧!$G$2:$G$301,プルダウン用データ!AA$3)","v":23},{"$f":"COUNTIFS(学校一覧!$G$2:$G$301,プルダウン用データ!AB$3)","v":20}]
[null,"--プルダウンでご選択ください--","秋田県立","秋田市立","井川町立","羽後町立","大潟村立","大館市立","男鹿市立","潟上市立","鹿角市立","上小阿仁村立","北秋田市立","小坂町立","五城目町立","仙北市立","大仙市立","にかほ市立","能代市立","八郎潟町立","八峰町立","東成瀬村立","藤里町立","美郷町立","三種町立","湯沢市立","由利本荘市立","横手市立","国立"]
[null,null,"大館国際情報学院中学校","保戸野小学校","井川義務教育学校","西馬音内小学校","大潟小学校","桂城小学校","船川第一小学校","大豊小学校","花輪小学校","上小阿仁小中学校","鷹巣小学校","小坂小学校","五城目小学校","角館小学校","大曲小学校","平沢小学校","渟城西小学校","八郎潟小学校","八森小学校","東成瀬小学校","義務教育学校藤里学園","六郷小学校","琴丘小学校","湯沢東小学校","新山小学校","横手南小学校","秋田大学教育文化学部附属小学校"]
[null,null,"秋田南高等学校 中等部","明徳小学校",null,"三輪小学校","大潟中学校","城南小学校","脇本第一小学校","飯田川小学校","柴平小学校",null,"鷹巣東小学校","小坂中学校","五城目第一中学校","白岩小学校","東大曲小学校","院内小学校","渟城南小学校","八郎潟中学校","峰浜小学校","東成瀬中学校",null,"千畑小学校","森岳小学校","湯沢西小学校","鶴舞小学校","朝倉小学校","秋田大学教育文化学部附属中学校"]
[null,null,"横手清陵学院中学校","築山小学校",null,"羽後明成小学校",null,"城西小学校","船越小学校","天王小学校","十和田小学校",null,"綴子小学校",null,null,"生保内小学校","花館小学校","金浦小学校","第四小学校",null,"八峰中学校",null,null,"仙南小学校","金岡小学校","山田小学校","尾崎小学校","旭小学校"]
[null,null,null,"旭北小学校",null,"高瀬小学校",null,"有浦小学校","北陽小学校","出戸小学校","大湯小学校",null,"清鷹小学校",null,null,"神代小学校","内小友小学校","象潟小学校","第五小学校",null,null,null,null,"美郷中学校","浜口小学校","稲川小学校","子吉小学校","栄小学校"]
[null,null,null,"中通小学校",null,"羽後中学校",null,"釈迦内小学校","払戸小学校","東湖小学校","尾去沢小学校",null,"米内沢小学校",null,null,"西明寺小学校","大川西根小学校","仁賀保中学校","向能代小学校",null,null,null,null,null,"湖北小学校","雄勝小学校","小友小学校","横手北小学校"]
[null,null,null,"旭南小学校",null,null,null,"長木小学校","美里小学校","追分小学校","八幡平小学校",null,"前田小学校",null,null,"桧木内小学校","藤木小学校","金浦中学校","浅内小学校",null,null,null,null,null,"琴丘中学校","皆瀬小学校","矢島小学校","増田小学校"]
[null,null,null,"牛島小学校",null,null,null,"川口小学校","男鹿南中学校","天王中学校","花輪中学校",null,"義務教育学校阿仁学園",null,null,"角館中学校","四ツ屋小学校","象潟中学校","二ツ井小学校",null,null,null,null,null,"山本中学校","湯沢北中学校","岩城小学校","浅舞小学校"]
[null,null,null,"川尻小学校",null,null,null,"上川沿小学校","男鹿東中学校","天王南中学校","十和田中学校",null,"合川小学校",null,null,"生保内中学校","角間川小学校",null,"能代第一中学校",null,null,null,null,null,"八竜中学校","山田中学校","由利小学校","吉田小学校"]
[null,null,null,"旭川小学校",null,null,null,"成章小学校",null,"羽城中学校","尾去沢中学校",null,"森吉中学校",null,null,"神代中学校","神岡小学校",null,"能代第二中学校",null,null,null,null,null,null,"湯沢南中学校","岩谷小学校","醍醐小学校"]
[null,null,null,"土崎小学校",null,null,null,"花岡小学校",null,null,"八幡平中学校",null,"鷹巣中学校",null,null,"西明寺中学校","西仙北小学校",null,"能代東中学校",null,null,null,null,null,null,"稲川中学校","大内小学校","雄物川小学校"]
[null,null,null,"港北小学校",null,null,null,"矢立小学校",null,null,null,null,"合川中学校",null,null,"桧木内中学校","清水小学校",null,"東雲中学校",null,null,null,null,null,null,"雄勝中学校","西目小学校","大森小学校"]
[null,null,null,"土崎南小学校",null,null,null,"南小学校",null,null,null,null,null,null,null,null,"豊成小学校",null,"能代南中学校",null,null,null,null,null,null,"皆瀬中学校","鳥海小学校","十文字小学校"]
[null,null,null,"高清水小学校",null,null,null,"扇田小学校",null,null,null,null,null,null,null,null,"中仙小学校",null,"二ツ井中学校",null,null,null,null,null,null,null,"東由利小学校","山内小学校"]
[null,null,null,"広面小学校",null,null,null,"西館小学校",null,null,null,null,null,null,null,null,"協和小学校",null,null,null,null,null,null,null,null,null,"本荘北中学校","大雄小学校"]
[null,null,null,"日新小学校",null,null,null,"東館小学校",null,null,null,null,null,null,null,null,"太田東小学校",null,null,null,null,null,null,null,null,null,"本荘南中学校","横手北中学校"]
[null,null,null,"太平小学校",null,null,null,"早口小学校",null,null,null,null,null,null,null,null,"太田南小学校",null,null,null,null,null,null,null,null,null,"本荘東中学校","横手南中学校"]
[null,null,null,"外旭川小学校",null,null,null,"山瀬小学校",null,null,null,null,null,null,null,null,"太田北小学校",null,null,null,null,null,null,null,null,null,"矢島中学校","増田中学校"]
{"$rows_left_out":43}